Cygwin

Get that Linux feeling - on Windows

Cygwin Mirror Report

StatusDescriptionCount
good mirror6
aalmost up-to-date mirror33
oout-of-date mirror94
*transient problem0
!persistent failure64
xdisabled mirror147

Reference fileSizemtime
noarch/release/python-pycparser/sha512.sum19682026-10-23 13:44 GMT
src/release/python-numpy/sha512.sum3222026-10-23 13:44 GMT
x86_64/release/python-numpy/sha512.sum19382026-10-23 13:44 GMT
x86_64/setup.xz36429882026-10-23 14:21 GMT
last-updated02026-10-23 14:21 GMT
noarch/release/cygport/sha512.sum12782026-10-23 14:44 GMT
src/release/cygport/sha512.sum6322026-10-23 14:44 GMT
x86_64/sha512.sum12782026-10-23 14:44 GMT

Good mirrors
URLStatusTime/sLagLast GoodLast mtimeLast progressError
ftp://ftp.iij.ad.jp/pub/cygwin/ 180:00:002026-10-23 15:01 UTC2026-10-23 14:44 UTC2026-10-23 15:01 UTC
http://ftp.fau.de/cygwin/ 20:00:002026-10-23 15:01 UTC2026-10-23 14:44 UTC2026-10-23 15:01 UTC
http://ftp.iij.ad.jp/pub/cygwin/ 40:00:002026-10-23 15:01 UTC2026-10-23 14:44 UTC2026-10-23 15:01 UTC
https://ftp.fau.de/cygwin/ 30:00:002026-10-23 15:01 UTC2026-10-23 14:44 UTC2026-10-23 15:01 UTC
https://ftp.iij.ad.jp/pub/cygwin/ 60:00:002026-10-23 15:01 UTC2026-10-23 14:44 UTC2026-10-23 15:01 UTC
rsync://ftp.fau.de/cygwin/ 120:00:002026-10-23 15:01 UTC2026-10-23 14:44 UTC2026-10-23 15:01 UTC

Out-of-date mirrors
URLStatusTime/sLagLast GoodLast mtimeLast progressError
ftp://ftp.byfly.by/pub/cygwin/o110:39:392026-10-23 12:01 UTC2026-10-23 11:14 UTC2026-10-23 12:01 UTC550 Failed to open file. [src/release/python-numpy/sha512.sum]
ftp://ftp.gwdg.de/pub/linux/sources.redhat.com/cygwin/o100:39:382026-10-23 12:01 UTC2026-10-23 11:14 UTC2026-10-23 12:01 UTC550 Failed to open file. [src/release/python-numpy/sha512.sum]
ftp://ftp.jaist.ac.jp/pub/cygwin/a200:39:392026-10-23 12:01 UTC2026-10-23 13:44 UTC2026-10-23 15:01 UTCFiles out of date (4/8)
ftp://ftp.yz.yamagata-u.ac.jp/pub/cygwin/a210:39:392026-10-23 12:01 UTC2026-10-23 14:21 UTC2026-10-23 15:01 UTCFiles out of date (3/8)
http://cygwin.cathedral-networks.org/a80:39:402026-10-23 12:01 UTC2026-10-23 14:21 UTC2026-10-23 15:01 UTCFiles out of date (3/8)
http://ftp.byfly.by/pub/cygwin/o30:39:392026-10-23 12:01 UTC2026-10-23 11:14 UTC2026-10-23 12:01 UTC404 Not Found [src/release/python-numpy/sha512.sum]
http://ftp.gwdg.de/pub/linux/sources.redhat.com/cygwin/o20:39:382026-10-23 12:01 UTC2026-10-23 11:14 UTC2026-10-23 12:01 UTC404 Not Found [src/release/python-numpy/sha512.sum]
http://ftp.jaist.ac.jp/pub/cygwin/a60:39:382026-10-23 12:01 UTC2026-10-23 13:44 UTC2026-10-23 15:01 UTCFiles out of date (4/8)
http://ftp.yz.yamagata-u.ac.jp/pub/cygwin/a70:39:382026-10-23 12:01 UTC2026-10-23 14:21 UTC2026-10-23 15:01 UTCFiles out of date (3/8)
http://mirrors.kernel.org/sourceware/cygwin/a100:39:372026-10-23 12:01 UTC2026-10-23 14:21 UTC2026-10-23 15:01 UTCFiles out of date (3/8)
https://cygwin.cathedral-networks.org/a80:39:402026-10-23 12:01 UTC2026-10-23 14:21 UTC2026-10-23 15:01 UTCFiles out of date (3/8)
https://cygwin.itefix.net/o30:39:392026-10-23 12:01 UTC2026-10-23 11:14 UTC2026-10-23 12:01 UTC404 Not Found [src/release/python-numpy/sha512.sum]
https://ftp.byfly.by/pub/cygwin/o40:39:382026-10-23 12:01 UTC2026-10-23 11:14 UTC2026-10-23 12:01 UTC404 Not Found [src/release/python-numpy/sha512.sum]
https://ftp.gwdg.de/pub/linux/sources.redhat.com/cygwin/o40:39:382026-10-23 12:01 UTC2026-10-23 11:14 UTC2026-10-23 12:01 UTC404 Not Found [src/release/python-numpy/sha512.sum]
https://ftp.jaist.ac.jp/pub/cygwin/a90:39:392026-10-23 12:01 UTC2026-10-23 13:44 UTC2026-10-23 15:01 UTCFiles out of date (4/8)
https://ftp.yz.yamagata-u.ac.jp/pub/cygwin/a90:39:382026-10-23 12:01 UTC2026-10-23 14:21 UTC2026-10-23 15:01 UTCFiles out of date (3/8)
https://mirrors.kernel.org/sourceware/cygwin/a350:39:442026-10-23 12:01 UTC2026-10-23 14:21 UTC2026-10-23 15:01 UTCFiles out of date (3/8)
https://mirrors.sjtug.sjtu.edu.cn/cygwin/a100:39:402026-10-23 12:01 UTC2026-10-23 14:21 UTC2026-10-23 15:01 UTCFiles out of date (3/8)
rsync://ftp.byfly.by/cygwin/o130:39:392026-10-23 12:01 UTC2026-10-23 11:14 UTC2026-10-23 12:01 UTC[sender] change_dir "/src/release/python-numpy" (in cygwin) failed: No such file or directory (2) rsync error: some files/attrs were not transferred (see previous errors) (code 23) at main.c(1766) [Receiver=3.1.3] [src/release/python-numpy/sha512.sum]
rsync://ftp.gwdg.de/pub/linux/sources.redhat.com/cygwin/o110:39:382026-10-23 12:01 UTC2026-10-23 11:14 UTC2026-10-23 12:01 UTC[sender] change_dir "linux/sources.redhat.com/cygwin/src/release/python-numpy" (in pub) failed: No such file or directory (2) rsync error: some files/attrs were not transferred (see previous errors) (code 23) at main.c(1766) [Receiver=3.1.3] [src/release/python-numpy/sha512.sum]
rsync://mirror.team-cymru.com/cygwin/o50:39:382026-10-23 12:01 UTC2026-10-23 11:14 UTC2026-10-23 12:01 UTC[sender] change_dir "/src/release/python-numpy" (in cygwin) failed: No such file or directory (2) rsync error: some files/attrs were not transferred (see previous errors) (code 23) at main.c(1766) [Receiver=3.1.3] [src/release/python-numpy/sha512.sum]
ftp://cygwin.mirror.rafal.ca/pub/cygwin/o30:39:382026-10-23 09:01 UTC2026-10-23 12:20 UTC2026-10-23 15:01 UTC550 Failed to open file. [src/release/python-numpy/sha512.sum]
ftp://cygwin.rtin.bz/cygwin/a80:39:382026-10-23 09:01 UTC2026-10-23 12:20 UTC2026-10-23 15:01 UTCFiles out of date (7/8)
ftp://ftp-stud.hs-esslingen.de/pub/Mirrors/sources.redhat.com/cygwin/o110:39:382026-10-23 09:01 UTC2026-10-22 20:44 UTC2026-10-23 00:01 UTC550 Failed to open file. [src/release/python-numpy/sha512.sum]
ftp://ftp.as3741.net/mirror/cygwin/o220:39:392026-10-23 09:01 UTC2026-10-22 20:44 UTC2026-10-23 03:01 UTC550 Failed to open file. [src/release/python-numpy/sha512.sum]
ftp://ftp.dimensiondata.com/mirrors/cygwin/o220:39:392026-10-23 09:01 UTC2026-10-22 20:44 UTC2026-10-23 00:01 UTC550 Failed to open file. [src/release/python-numpy/sha512.sum]
ftp://ftp.eq.uc.pt/pub/software/pc/prog/cygwin/o100:39:382026-10-23 09:01 UTC2026-10-23 11:14 UTC2026-10-23 15:01 UTC550 Failed to open file. [src/release/python-numpy/sha512.sum]
ftp://ftp.fagskolen.gjovik.no/pub/cygwin/o120:39:392026-10-23 09:01 UTC2026-10-22 20:44 UTC2026-10-23 06:01 UTC550 /pub/cygwin/src/release/python-numpy/sha512.sum: No such file or directory.
ftp://ftp.funet.fi/pub/mirrors/sourceware.org/pub/cygwin/o100:39:392026-10-23 09:01 UTC2026-10-22 20:44 UTC2026-10-23 00:01 UTC550 Can't open /pub/mirrors/sourceware.org/pub/cygwin/src/release/python-numpy/sha512.sum: No such file or directory
ftp://ftp.halifax.rwth-aachen.de/cygwin/o100:39:392026-10-23 09:01 UTC2026-10-23 12:44 UTC2026-10-23 15:01 UTC550 Failed to open file. [src/release/python-numpy/sha512.sum]
ftp://ftp.inf.tu-dresden.de/software/windows/cygwin32/o110:39:392026-10-23 09:01 UTC2026-10-22 20:44 UTC2026-10-23 03:01 UTC550 /software/windows/cygwin32/src/release/python-numpy/sha512.sum: No such file or directory
ftp://ftp.kr.freebsd.org/pub/cygwin.com/cygwin/o200:39:392026-10-23 09:01 UTC2026-10-22 20:44 UTC2026-10-23 06:01 UTC550 /pub/cygwin.com/cygwin/src/release/python-numpy/sha512.sum: No such file or directory.
ftp://ftp.lip6.fr/pub/cygwin/o300:39:382026-10-23 09:01 UTC2026-10-22 18:44 UTC2026-10-23 06:01 UTC550 /pub/cygwin/src/release/python-numpy/sha512.sum: No such file or directory.
ftp://ftp.mirrorservice.org/sites/sourceware.org/pub/cygwin/o90:39:382026-10-23 09:01 UTC2026-10-23 12:20 UTC2026-10-23 15:01 UTC550 Failed to open file. [src/release/python-numpy/sha512.sum]
ftp://ftp.snt.utwente.nl/pub/software/cygwin/a90:39:382026-10-23 09:01 UTC2026-10-23 13:44 UTC2026-10-23 15:01 UTCFiles out of date (4/8)
ftp://linux.rz.ruhr-uni-bochum.de/cygwin/o100:39:392026-10-23 09:01 UTC2026-10-22 20:44 UTC2026-10-23 00:01 UTC550 /cygwin/src/release/python-numpy/sha512.sum: No such file or directory
ftp://mirror.checkdomain.de/cygwin/o100:39:402026-10-23 09:01 UTC2026-10-22 20:44 UTC2026-10-23 06:01 UTC550 /cygwin/src/release/python-numpy/sha512.sum: No such file or directory
ftp://mirror.csclub.uwaterloo.ca/cygwin/o40:39:382026-10-23 09:01 UTC2026-10-23 08:44 UTC2026-10-23 15:01 UTC550 Failed to open file. [src/release/python-numpy/sha512.sum]
ftp://mirror.datacenter.by/pub/mirrors/cygwin/a120:39:382026-10-23 09:01 UTC2026-10-23 10:44 UTC2026-10-23 15:01 UTCFiles out of date (4/8)
ftp://mirrors.dotsrc.org/mirrors/cygwin/o110:39:402026-10-23 09:01 UTC2026-10-23 12:44 UTC2026-10-23 15:01 UTC550 Failed to open file. [src/release/python-numpy/sha512.sum]
ftp://mirrors.sonic.net/cygwin/a80:39:382026-10-23 09:01 UTC2026-10-23 13:44 UTC2026-10-23 15:01 UTCFiles out of date (4/8)
http://cygwin.mirror.constant.com/a00:39:392026-10-23 09:01 UTC2026-10-23 14:21 UTC2026-10-23 15:01 UTCFiles out of date (3/8)
http://cygwin.mirror.rafal.ca/o00:39:392026-10-23 09:01 UTC2026-10-23 12:20 UTC2026-10-23 15:01 UTC404 Not Found [src/release/python-numpy/sha512.sum]
http://cygwin.mirror.uk.sargasso.net/o30:39:382026-10-23 09:01 UTC2026-10-22 20:44 UTC2026-10-23 03:01 UTC404 Not Found [src/release/python-numpy/sha512.sum]
http://cygwin.osuosl.org/a20:39:392026-10-23 09:01 UTC2026-10-23 14:21 UTC2026-10-23 15:01 UTCFiles out of date (3/8)
http://cygwin.uib.no/o50:39:392026-10-23 09:01 UTC2026-10-22 20:44 UTC2026-10-23 09:01 UTC404 Not Found [src/release/python-numpy/sha512.sum]
http://ftp-stud.hs-esslingen.de/pub/Mirrors/sources.redhat.com/cygwin/o20:39:392026-10-23 09:01 UTC2026-10-22 20:44 UTC2026-10-23 00:01 UTC404 Not Found [src/release/python-numpy/sha512.sum]
http://ftp.eq.uc.pt/software/pc/prog/cygwin/o20:39:392026-10-23 09:01 UTC2026-10-23 11:14 UTC2026-10-23 15:01 UTC404 Not Found [src/release/python-numpy/sha512.sum]
http://ftp.fagskolen.gjovik.no/pub/cygwin/o80:39:392026-10-23 09:01 UTC2026-10-22 20:44 UTC2026-10-23 06:01 UTC404 Not Found [src/release/python-numpy/sha512.sum]
http://ftp.inf.tu-dresden.de/software/windows/cygwin32/o20:39:402026-10-23 09:01 UTC2026-10-22 20:44 UTC2026-10-23 03:01 UTC404 Not Found [src/release/python-numpy/sha512.sum]
http://ftp.lip6.fr/pub/cygwin/o1320:39:522026-10-23 09:01 UTC2026-10-22 18:44 UTC2026-10-23 06:01 UTC404 Not Found [src/release/python-numpy/sha512.sum]
http://ftp.ntu.edu.tw/pub/cygwin/o160:39:382026-10-23 09:01 UTC2026-10-22 20:44 UTC2026-10-23 00:01 UTC404 Not Found [src/release/python-numpy/sha512.sum]
http://ftp.rnl.tecnico.ulisboa.pt/pub/cygwin/o20:39:392026-10-23 09:01 UTC2026-10-22 20:44 UTC2026-10-23 06:01 UTC404 Not Found [src/release/python-numpy/sha512.sum]
http://ftp.snt.utwente.nl/pub/software/cygwin/a20:39:392026-10-23 09:01 UTC2026-10-23 13:44 UTC2026-10-23 15:01 UTCFiles out of date (4/8)
http://mirror-hk.koddos.net/cygwin/o520:39:382026-10-23 09:01 UTC2026-10-22 20:44 UTC2026-10-23 00:01 UTC404 Not Found [src/release/python-numpy/sha512.sum]
http://mirror.aarnet.edu.au/pub/sourceware/cygwin/o50:39:392026-10-23 09:01 UTC2026-10-23 11:14 UTC2026-10-23 15:01 UTC404 Not Found [src/release/python-numpy/sha512.sum]
http://mirror.checkdomain.de/cygwin/o20:39:402026-10-23 09:01 UTC2026-10-22 20:44 UTC2026-10-23 06:01 UTC404 Not Found [src/release/python-numpy/sha512.sum]
http://mirror.csclub.uwaterloo.ca/cygwin/o10:39:392026-10-23 09:01 UTC2026-10-23 12:44 UTC2026-10-23 15:01 UTC404 Not Found [src/release/python-numpy/sha512.sum]
http://mirror.datacenter.by/pub/mirrors/cygwin/a20:39:382026-10-23 09:01 UTC2026-10-23 13:44 UTC2026-10-23 15:01 UTCFiles out of date (4/8)
http://mirror.lagoon.nc/cygwin/o70:39:382026-10-23 09:01 UTC2026-10-22 20:44 UTC2026-10-23 09:01 UTC404 Not Found [src/release/python-numpy/sha512.sum]
http://mirror.team-cymru.com/cygwin/o00:39:402026-10-23 09:01 UTC2026-10-23 11:14 UTC2026-10-23 15:01 UTC404 Not Found [src/release/python-numpy/sha512.sum]
http://mirrors.dotsrc.org/cygwin/o30:39:392026-10-23 09:01 UTC2026-10-23 12:44 UTC2026-10-23 15:01 UTC404 Not Found [src/release/python-numpy/sha512.sum]
http://mirrors.sonic.net/cygwin/a10:39:382026-10-23 09:01 UTC2026-10-23 13:44 UTC2026-10-23 15:01 UTCFiles out of date (4/8)
http://mirrors.xmission.com/cygwin/a10:39:392026-10-23 09:01 UTC2026-10-23 13:44 UTC2026-10-23 15:01 UTCFiles out of date (4/8)
http://sourceware.mirror.garr.it/cygwin/a30:39:402026-10-23 09:01 UTC2026-10-23 13:44 UTC2026-10-23 15:01 UTCFiles out of date (4/8)
http://www.gtlib.gatech.edu/pub/cygwin/o00:39:392026-10-23 09:01 UTC2026-10-22 20:44 UTC2026-10-23 09:01 UTC404 Not Found [src/release/python-numpy/sha512.sum]
http://www.mirrorservice.org/sites/sourceware.org/pub/cygwin/o30:39:392026-10-23 09:01 UTC2026-10-23 12:20 UTC2026-10-23 15:01 UTC404 Not Found [src/release/python-numpy/sha512.sum]
https://cygwin.mirror.constant.com/a00:39:392026-10-23 09:01 UTC2026-10-23 14:21 UTC2026-10-23 15:01 UTCFiles out of date (3/8)
https://cygwin.mirror.uk.sargasso.net/o30:39:392026-10-23 09:01 UTC2026-10-22 20:44 UTC2026-10-23 03:01 UTC404 Not Found [src/release/python-numpy/sha512.sum]
https://cygwin.osuosl.org/a70:39:392026-10-23 09:01 UTC2026-10-23 14:21 UTC2026-10-23 15:01 UTCFiles out of date (3/8)
https://cygwin.rtin.bz/o30:39:382026-10-23 09:01 UTC2026-10-23 12:20 UTC2026-10-23 15:01 UTC404 Not Found [src/release/python-numpy/sha512.sum]
https://cygwin.uib.no/o120:39:392026-10-23 09:01 UTC2026-10-22 20:44 UTC2026-10-23 09:01 UTC404 Not Found [src/release/python-numpy/sha512.sum]
https://ftp-stud.hs-esslingen.de/pub/Mirrors/sources.redhat.com/cygwin/o30:39:382026-10-23 09:01 UTC2026-10-22 20:44 UTC2026-10-23 00:01 UTC404 Not Found [src/release/python-numpy/sha512.sum]
https://ftp.dimensiondata.com/mirrors/cygwin/o130:39:382026-10-23 09:01 UTC2026-10-22 20:44 UTC2026-10-23 00:01 UTC404 Not Found [src/release/python-numpy/sha512.sum]
https://ftp.eq.uc.pt/software/pc/prog/cygwin/o30:39:392026-10-23 09:01 UTC2026-10-23 11:14 UTC2026-10-23 15:01 UTC404 Not Found [src/release/python-numpy/sha512.sum]
https://ftp.fagskolen.gjovik.no/pub/cygwin/o40:39:392026-10-23 09:01 UTC2026-10-22 20:44 UTC2026-10-23 06:01 UTC404 Not Found [src/release/python-numpy/sha512.sum]
https://ftp.funet.fi/pub/mirrors/sourceware.org/pub/cygwin/o40:39:392026-10-23 09:01 UTC2026-10-22 20:44 UTC2026-10-23 00:01 UTC404 Not Found [src/release/python-numpy/sha512.sum]
https://ftp.halifax.rwth-aachen.de/cygwin/o40:39:392026-10-23 09:01 UTC2026-10-23 12:44 UTC2026-10-23 15:01 UTC404 Not Found [src/release/python-numpy/sha512.sum]
https://ftp.inf.tu-dresden.de/software/windows/cygwin32/o40:39:392026-10-23 09:01 UTC2026-10-22 20:44 UTC2026-10-23 03:01 UTC404 Not Found [src/release/python-numpy/sha512.sum]
https://ftp.kaist.ac.kr/cygwin/o70:39:382026-10-23 09:01 UTC2026-10-22 20:44 UTC2026-10-23 06:01 UTC404 Not Found [src/release/python-numpy/sha512.sum]
https://ftp.kr.freebsd.org/pub/cygwin.com/cygwin/o70:39:382026-10-23 09:01 UTC2026-10-22 20:44 UTC2026-10-23 06:01 UTC404 Not Found [src/release/python-numpy/sha512.sum]
https://ftp.lip6.fr/pub/cygwin/o90:39:392026-10-23 09:01 UTC2026-10-22 18:44 UTC2026-10-23 06:01 UTC404 Not Found [src/release/python-numpy/sha512.sum]
https://ftp.ntu.edu.tw/pub/cygwin/o180:39:392026-10-23 09:01 UTC2026-10-22 20:44 UTC2026-10-23 00:01 UTC404 Not Found [src/release/python-numpy/sha512.sum]
https://ftp.rnl.tecnico.ulisboa.pt/pub/cygwin/o40:39:382026-10-23 09:01 UTC2026-10-22 20:44 UTC2026-10-23 06:01 UTC404 Not Found [src/release/python-numpy/sha512.sum]
https://ftp.snt.utwente.nl/pub/software/cygwin/a30:39:392026-10-23 09:01 UTC2026-10-23 13:44 UTC2026-10-23 15:01 UTCFiles out of date (4/8)
https://mirror-hk.koddos.net/cygwin/o70:39:382026-10-23 09:01 UTC2026-10-22 20:44 UTC2026-10-23 00:01 UTC404 Not Found [src/release/python-numpy/sha512.sum]
https://mirror.aarnet.edu.au/pub/sourceware/cygwin/o70:39:392026-10-23 09:01 UTC2026-10-23 11:14 UTC2026-10-23 15:01 UTC404 Not Found [src/release/python-numpy/sha512.sum]
https://mirror.accum.se/mirror/cygwin/o40:39:392026-10-23 09:01 UTC2026-10-22 20:44 UTC2026-10-23 06:01 UTC404 Not Found [src/release/python-numpy/sha512.sum]
https://mirror.alastyr.com/cygwin/o40:39:382026-10-23 09:01 UTC2026-10-22 20:44 UTC2026-10-23 00:01 UTC404 Not Found [src/release/python-numpy/sha512.sum]
https://mirror.as3741.net/mirror/cygwin/o70:39:382026-10-23 09:01 UTC2026-10-22 20:44 UTC2026-10-23 00:01 UTC404 Not Found [src/release/python-numpy/sha512.sum]
https://mirror.checkdomain.de/cygwin/o40:39:392026-10-23 09:01 UTC2026-10-22 20:44 UTC2026-10-23 06:01 UTC404 Not Found [src/release/python-numpy/sha512.sum]
https://mirror.csclub.uwaterloo.ca/cygwin/o10:39:392026-10-23 09:01 UTC2026-10-23 12:44 UTC2026-10-23 15:01 UTC404 Not Found [src/release/python-numpy/sha512.sum]
https://mirror.datacenter.by/pub/mirrors/cygwin/a40:39:382026-10-23 09:01 UTC2026-10-23 13:44 UTC2026-10-23 15:01 UTCFiles out of date (4/8)
https://mirror.dogado.de/cygwin/o40:39:392026-10-23 09:01 UTC2026-10-22 20:44 UTC2026-10-23 00:01 UTC404 Not Found [src/release/python-numpy/sha512.sum]
https://mirror.lagoon.nc/cygwin/o100:39:392026-10-23 09:01 UTC2026-10-22 20:44 UTC2026-10-23 09:01 UTC404 Not Found [src/release/python-numpy/sha512.sum]
https://mirror.team-cymru.com/cygwin/o10:39:392026-10-23 09:01 UTC2026-10-23 11:14 UTC2026-10-23 15:01 UTC404 Not Found [src/release/python-numpy/sha512.sum]
https://mirrors.cicku.me/cygwin/a20:39:392026-10-23 09:01 UTC2026-10-23 12:20 UTC2026-10-23 15:01 UTCFiles out of date (4/8)
https://mirrors.dotsrc.org/cygwin/o40:39:392026-10-23 09:01 UTC2026-10-23 12:44 UTC2026-10-23 15:01 UTC404 Not Found [src/release/python-numpy/sha512.sum]
https://mirrors.filigrane-technologie.fr/cygwin/o30:39:392026-10-23 09:01 UTC2026-10-22 20:44 UTC2026-10-23 00:01 UTC404 Not Found [src/release/python-numpy/sha512.sum]
https://mirrors.rit.edu/cygwin/o20:39:392026-10-23 09:01 UTC2026-10-22 20:44 UTC2026-10-23 03:01 UTC404 Not Found [src/release/python-numpy/sha512.sum]
https://mirrors.sonic.net/cygwin/a20:39:392026-10-23 09:01 UTC2026-10-23 13:44 UTC2026-10-23 15:01 UTCFiles out of date (4/8)
https://mirrors.tuna.tsinghua.edu.cn/sourceware/cygwin/o70:39:382026-10-23 09:01 UTC2026-10-23 12:20 UTC2026-10-23 15:01 UTC404 Not Found [src/release/python-numpy/sha512.sum]
https://mirrors.xmission.com/cygwin/a20:39:392026-10-23 09:01 UTC2026-10-23 13:44 UTC2026-10-23 15:01 UTCFiles out of date (4/8)
https://sourceware.mirror.garr.it/cygwin/a30:39:392026-10-23 09:01 UTC2026-10-23 13:44 UTC2026-10-23 15:01 UTCFiles out of date (4/8)
https://www.mirrorservice.org/sites/sourceware.org/pub/cygwin/o30:39:382026-10-23 09:01 UTC2026-10-23 12:20 UTC2026-10-23 15:01 UTC404 Not Found [src/release/python-numpy/sha512.sum]
rsync://cygwin.rtin.bz/cygwin/o110:39:402026-10-23 09:01 UTC2026-10-23 12:20 UTC2026-10-23 15:01 UTC[sender] change_dir "/src/release/python-numpy" (in cygwin) failed: No such file or directory (2) rsync error: some files/attrs were not transferred (see previous errors) (code 23) at main.c(1766) [Receiver=3.1.3] [src/release/python-numpy/sha512.sum]
rsync://ftp.fagskolen.gjovik.no/cygwin/o120:39:392026-10-23 09:01 UTC2026-10-22 20:44 UTC2026-10-23 06:01 UTC[sender] change_dir "src/release/python-numpy" (in cygwin) failed: No such file or directory (2) rsync error: some files/attrs were not transferred (see previous errors) (code 23) at main.c(1766) [Receiver=3.1.3] [src/release/python-numpy/sha512.sum]
rsync://ftp.halifax.rwth-aachen.de/cygwin/o100:39:392026-10-23 09:01 UTC2026-10-23 12:44 UTC2026-10-23 15:01 UTC[sender] change_dir "/src/release/python-numpy" (in cygwin) failed: No such file or directory (2) rsync error: some files/attrs were not transferred (see previous errors) (code 23) at main.c(1766) [Receiver=3.1.3] [src/release/python-numpy/sha512.sum]
rsync://ftp.inf.tu-dresden.de/cygwin/o110:39:392026-10-23 09:01 UTC2026-10-22 20:44 UTC2026-10-23 03:01 UTC[sender] change_dir "/src/release/python-numpy" (in cygwin) failed: No such file or directory (2) rsync error: some files/attrs were not transferred (see previous errors) (code 23) at main.c(1766) [Receiver=3.1.3] [src/release/python-numpy/sha512.sum]
rsync://ftp.kaist.ac.kr/cygwin/o330:39:422026-10-23 09:01 UTC2026-10-22 20:44 UTC2026-10-23 06:01 UTC[sender] change_dir "src/release/python-numpy" (in cygwin) failed: No such file or directory (2) rsync error: some files/attrs were not transferred (see previous errors) (code 23) at main.c(1766) [Receiver=3.1.3] [src/release/python-numpy/sha512.sum]
rsync://ftp.kr.freebsd.org/cygwin/cygwin/o190:39:392026-10-23 09:01 UTC2026-10-22 20:44 UTC2026-10-23 06:01 UTC[sender] change_dir "cygwin/src/release/python-numpy" (in cygwin) failed: No such file or directory (2) rsync error: some files/attrs were not transferred (see previous errors) (code 23) at main.c(1766) [Receiver=3.1.3] [src/release/python-numpy/sha512.sum]
rsync://ftp.lip6.fr/ftp/pub/cygwin/o130:39:382026-10-23 09:01 UTC2026-10-22 18:44 UTC2026-10-23 06:01 UTC[sender] change_dir "pub/cygwin/src/release/python-numpy" (in ftp) failed: No such file or directory (2) rsync error: some files/attrs were not transferred (see previous errors) (code 23) at main.c(1766) [Receiver=3.1.3] [src/release/python-numpy/sha512.sum]
rsync://ftp.snt.utwente.nl/cygwin-ftp/a120:39:412026-10-23 09:01 UTC2026-10-23 13:44 UTC2026-10-23 15:01 UTCFiles out of date (4/8)
rsync://mirror-hk.koddos.net/cygwin/o320:39:392026-10-23 09:01 UTC2026-10-22 20:44 UTC2026-10-23 00:01 UTCchange_dir "/src/release/python-numpy" (in cygwin) failed: No such file or directory (2) rsync error: some files/attrs were not transferred (see previous errors) (code 23) at main.c(1766) [Receiver=3.1.3] [src/release/python-numpy/sha512.sum]
rsync://mirror.accum.se/mirror/cygwin/o140:39:412026-10-23 09:01 UTC2026-10-22 20:44 UTC2026-10-23 06:01 UTC[sender] change_dir "/cygwin/src/release/python-numpy" (in mirror) failed: No such file or directory (2) rsync error: some files/attrs were not transferred (see previous errors) (code 23) at main.c(1766) [Receiver=3.1.3] [src/release/python-numpy/sha512.sum]
rsync://mirror.alastyr.com/cygwin/o150:39:392026-10-23 09:01 UTC2026-10-22 20:44 UTC2026-10-23 00:01 UTC[sender] change_dir "/src/release/python-numpy" (in cygwin) failed: No such file or directory (2) rsync error: some files/attrs were not transferred (see previous errors) (code 23) at main.c(1766) [Receiver=3.1.3] [src/release/python-numpy/sha512.sum]
rsync://mirror.datacenter.by/cygwin/a120:39:382026-10-23 09:01 UTC2026-10-23 13:44 UTC2026-10-23 15:01 UTCFiles out of date (4/8)
rsync://mirror.lagoon.nc/cygwin/o290:39:422026-10-23 09:01 UTC2026-10-22 20:44 UTC2026-10-23 09:01 UTC[sender] change_dir "/src/release/python-numpy" (in cygwin) failed: No such file or directory (2) rsync error: some files/attrs were not transferred (see previous errors) (code 23) at main.c(1766) [Receiver=3.1.3] [src/release/python-numpy/sha512.sum]
rsync://mirrors.tuna.tsinghua.edu.cn/sourceware/cygwin/o170:39:392026-10-23 09:01 UTC2026-10-23 12:20 UTC2026-10-23 15:01 UTC[sender] change_dir "/cygwin/src/release/python-numpy" (in sourceware) failed: No such file or directory (2) rsync error: some files/attrs were not transferred (see previous errors) (code 23) at main.c(1766) [Receiver=3.1.3] [src/release/python-numpy/sha512.sum]
rsync://rsync.as3741.net/mirror/cygwin/o230:39:392026-10-23 09:01 UTC2026-10-22 20:44 UTC2026-10-23 03:01 UTC[sender] change_dir "/cygwin/src/release/python-numpy" (in mirror) failed: No such file or directory (2) rsync error: some files/attrs were not transferred (see previous errors) (code 23) at main.c(1766) [Receiver=3.1.3] [src/release/python-numpy/sha512.sum]
rsync://rsync.mirrorservice.org/sourceware.org/pub/cygwin/o110:39:392026-10-23 09:01 UTC2026-10-23 12:20 UTC2026-10-23 15:01 UTC[sender] change_dir "/pub/cygwin/src/release/python-numpy" (in sourceware.org) failed: No such file or directory (2) rsync error: some files/attrs were not transferred (see previous errors) (code 23) at main.c(1766) [Receiver=3.1.3] [src/release/python-numpy/sha512.sum]
rsync://rsync2.osuosl.org/cygwin/a190:39:382026-10-23 09:01 UTC2026-10-23 14:21 UTC2026-10-23 15:01 UTCFiles out of date (3/8)
http://mirror.cpsc.ucalgary.ca/mirror/cygwin.com/o100:39:392026-10-23 06:01 UTC2026-10-23 12:20 UTC2026-10-23 15:01 UTC404 Not Found [src/release/python-numpy/sha512.sum]
https://mirror.cpsc.ucalgary.ca/mirror/cygwin.com/o610:39:482026-10-23 00:01 UTC2026-10-23 12:20 UTC2026-10-23 15:01 UTC404 Not Found [src/release/python-numpy/sha512.sum]
http://mirror.clarkson.edu/cygwin/o10:39:392026-10-22 15:01 UTC2026-10-23 11:14 UTC2026-10-23 15:01 UTC404 Not Found [src/release/python-numpy/sha512.sum]
https://mirror.clarkson.edu/cygwin/o10:39:392026-10-22 15:01 UTC2026-10-23 11:14 UTC2026-10-23 15:01 UTC404 Not Found [src/release/python-numpy/sha512.sum]
https://mirror.wisegs.com/cygwin/o20:39:372026-10-22 15:01 UTC2026-10-23 12:20 UTC2026-10-23 15:01 UTC404 Not Found [src/release/python-numpy/sha512.sum]

Problem mirrors
URLStatusTime/sLagLast GoodLast mtimeLast progressError
https://mirrors.tencent.com/cygwin/!30:39:392026-10-22 09:01 UTC2026-10-22 20:44 UTC2026-10-23 06:01 UTC404 Not Found [src/release/python-numpy/sha512.sum]
http://mirrors.ustc.edu.cn/cygwin/!120:39:432026-10-20 21:01 UTC2026-10-22 19:52 UTC2026-10-22 21:01 UTC404 Not Found [src/release/python-numpy/sha512.sum]
https://mirrors.aliyun.com/cygwin/!240:39:372026-10-20 21:01 UTC2026-10-22 17:44 UTC2026-10-23 00:01 UTC404 Not Found [src/release/python-numpy/sha512.sum]
https://mirrors.ustc.edu.cn/cygwin/!130:39:432026-10-20 21:01 UTC2026-10-22 19:52 UTC2026-10-22 21:01 UTC404 Not Found [src/release/python-numpy/sha512.sum]
ftp://mirror.cs.vt.edu/cygwin/cygwin/!1640:39:522026-10-20 15:01 UTC2026-10-22 20:44 UTC2026-10-23 12:01 UTC550 Failed to open file. [src/release/python-numpy/sha512.sum]
http://linorg.usp.br/cygwin/!40:39:392026-10-20 15:01 UTC2026-10-19 22:14 UTC2026-10-20 06:01 UTC404 Not Found [src/release/python-numpy/sha512.sum]
https://linorg.usp.br/cygwin/!60:39:392026-10-20 15:01 UTC2026-10-19 22:14 UTC2026-10-20 06:01 UTC404 Not Found [src/release/python-numpy/sha512.sum]
https://mirror.cs.vt.edu/pub/cygwin/cygwin/!1540:39:522026-10-20 15:01 UTC2026-10-22 20:44 UTC2026-10-23 12:01 UTC404 Not Found [src/release/python-numpy/sha512.sum]
https://mirrors.huaweicloud.com/cygwin/!130:39:392026-10-20 15:01 UTC2026-10-22 20:44 UTC2026-10-23 12:01 UTC404 Not Found [src/release/python-numpy/sha512.sum]
https://polish-mirror.evolution-host.com/cygwin/!40:39:392026-10-20 15:01 UTC2026-10-22 20:44 UTC2026-10-23 12:01 UTC404 Not Found [src/release/python-numpy/sha512.sum]
http://mirror.cs.vt.edu/pub/cygwin/cygwin/!105Unknown2026-10-19 12:01 UTC2026-10-22 20:44 UTC2026-10-23 12:01 UTCConnection timed out
ftp://sunsite.icm.edu.pl/pub/cygnus/cygwin/!110:39:382026-10-18 12:01 UTC2026-10-22 15:44 UTC2026-10-23 00:01 UTC550 Failed to open file. [src/release/python-numpy/sha512.sum]
https://sunsite.icm.edu.pl/pub/cygnus/cygwin/!70:39:392026-10-18 12:01 UTC2026-10-22 15:44 UTC2026-10-23 03:01 UTC404 Not Found [src/release/python-numpy/sha512.sum]
https://mirrors.zju.edu.cn/cygwin/!381Unknown2026-10-18 09:01 UTC2026-10-22 20:44 UTC2026-10-22 21:01 UTCIncompleteRead(1536824 bytes read, 2106476 more expected)
ftp://ftp.twaren.net/Unix/sourceware.org/cygwin/!610:39:422026-10-16 21:01 UTC2026-10-22 17:44 UTC2026-10-22 21:01 UTC550 Failed to open file. [src/release/python-numpy/sha512.sum]
ftp://mirrors.neterra.net/cygwin/!120:39:382026-10-16 21:01 UTC2026-10-22 20:38 UTC2026-10-23 00:01 UTC550 Failed to open file. [src/release/python-numpy/sha512.sum]
ftp://mirrors.netix.net/cygwin/!120:39:382026-10-16 21:01 UTC2026-10-22 20:38 UTC2026-10-23 00:01 UTC550 Failed to open file. [src/release/python-numpy/sha512.sum]
http://ftp.twaren.net/Unix/sourceware.org/cygwin/!390:39:522026-10-16 21:01 UTC2026-10-22 17:44 UTC2026-10-22 21:01 UTC404 Not Found [src/release/python-numpy/sha512.sum]
http://mirrors.163.com/cygwin/!210:39:382026-10-16 21:01 UTC2026-10-21 21:44 UTC2026-10-22 18:01 UTC404 Not Found [src/release/python-numpy/sha512.sum]
http://mirrors.netix.net/cygwin/!30:39:382026-10-16 21:01 UTC2026-10-22 20:38 UTC2026-10-23 00:01 UTC404 Not Found [src/release/python-numpy/sha512.sum]
https://mirror.mangohost.net/cygwin/!40:39:382026-10-16 21:01 UTC2026-10-22 20:38 UTC2026-10-23 03:01 UTC404 Not Found [src/release/python-numpy/sha512.sum]
https://mirrors.neterra.net/cygwin/!40:39:382026-10-16 21:01 UTC2026-10-22 20:38 UTC2026-10-23 00:01 UTC404 Not Found [src/release/python-numpy/sha512.sum]
https://mirrors.netix.net/cygwin/!40:39:382026-10-16 21:01 UTC2026-10-22 20:38 UTC2026-10-23 00:01 UTC404 Not Found [src/release/python-numpy/sha512.sum]
rsync://mirror.mangohost.net/cygwin/!130:39:392026-10-16 21:01 UTC2026-10-22 20:38 UTC2026-10-23 03:01 UTCchange_dir "/src/release/python-numpy" (in cygwin) failed: No such file or directory (2) rsync error: some files/attrs were not transferred (see previous errors) (code 23) at main.c(1766) [Receiver=3.1.3] [src/release/python-numpy/sha512.sum]
rsync://mirrors.neterra.net/cygwin/!120:39:382026-10-16 21:01 UTC2026-10-22 20:38 UTC2026-10-23 00:01 UTC[sender] change_dir "/src/release/python-numpy" (in cygwin) failed: No such file or directory (2) rsync error: some files/attrs were not transferred (see previous errors) (code 23) at main.c(1766) [Receiver=3.1.3] [src/release/python-numpy/sha512.sum]
rsync://mirrors.netix.net/cygwin/!120:39:382026-10-16 21:01 UTC2026-10-22 20:38 UTC2026-10-23 00:01 UTC[sender] change_dir "/src/release/python-numpy" (in cygwin) failed: No such file or directory (2) rsync error: some files/attrs were not transferred (see previous errors) (code 23) at main.c(1766) [Receiver=3.1.3] [src/release/python-numpy/sha512.sum]
https://mirror.clientvps.com/cygwin/!30:39:392026-10-16 03:01 UTC2026-10-22 20:38 UTC2026-10-23 00:01 UTC404 Not Found [src/release/python-numpy/sha512.sum]
https://mirrors.163.com/cygwin/!320:39:382026-10-13 06:01 UTC2026-10-21 21:44 UTC2026-10-22 18:01 UTC404 Not Found [src/release/python-numpy/sha512.sum]
rsync://mirror.wisegs.com/cygwin/!15Unknown2026-10-13 06:01 UTC2026-10-13 07:44 UTC2026-10-13 15:01 UTCfailed to connect to mirror.wisegs.com (47.180.154.140): Connection timed out (110) rsync error: error in socket IO (code 10) at clientserver.c(152) [Receiver=3.1.3]
http://mirror.isoc.org.il/pub/cygwin/!1Unknown2026-10-08 15:01 UTC2026-10-07 21:14 UTC2026-10-08 00:01 UTC404 Not Found [x86_64/sha512.sum]
https://mirror.isoc.org.il/pub/cygwin/!2Unknown2026-10-08 15:01 UTC2026-10-07 21:14 UTC2026-10-08 00:01 UTC404 Not Found [x86_64/sha512.sum]
http://linux.rz.ruhr-uni-bochum.de/download/cygwin/!0Unknown2026-09-29 21:01 UTC2026-09-29 07:14 UTC2026-09-29 12:01 UTC404 Not Found [x86_64/sha512.sum]
https://linux.rz.ruhr-uni-bochum.de/download/cygwin/!1Unknown2026-09-29 21:01 UTC2026-09-29 07:14 UTC2026-09-29 12:01 UTC404 Not Found [x86_64/sha512.sum]
ftp://ftp.rnl.tecnico.ulisboa.pt/pub/cygwin/!3Unknown2026-08-28 00:01 UTC2026-08-28 02:14 UTC2026-08-28 06:01 UTC550 Failed to open file. [x86_64/sha512.sum]
http://download.nus.edu.sg/mirror/cygwin/!1Unknown2026-08-03 15:01 UTC2026-08-02 19:14 UTC2026-08-03 06:01 UTCName or service not known
https://download.nus.edu.sg/mirror/cygwin/!1Unknown2026-08-03 15:01 UTC2026-08-02 19:14 UTC2026-08-03 06:01 UTCName or service not known
ftp://ftp.muug.ca/mirror/cygwin/!1Unknown2026-07-26 03:01 UTC2026-07-25 21:44 UTC2026-07-26 00:01 UTC550 Can't open /mirror/cygwin/x86_64/sha512.sum: No such file or directory
http://muug.ca/mirror/cygwin/!0Unknown2026-07-26 03:01 UTC2026-07-25 21:44 UTC2026-07-26 00:01 UTC404 Not Found [x86_64/sha512.sum]
https://muug.ca/mirror/cygwin/!0Unknown2026-07-26 03:01 UTC2026-07-25 21:44 UTC2026-07-26 00:01 UTC404 Not Found [x86_64/sha512.sum]
ftp://mirror.easyname.at/cygwin/!110:39:392026-07-08 15:01 UTC2026-07-15 04:12 UTC2026-10-15 00:01 UTC550 /cygwin/src/release/cygport/sha512.sum: No such file or directory
http://mirror.easyname.at/cygwin/!20:39:392026-07-08 15:01 UTC2026-07-15 04:12 UTC2026-10-15 00:01 UTC404 Not Found [src/release/cygport/sha512.sum]
https://mirror.easyname.at/cygwin/!0Unknown2026-07-08 15:01 UTC2026-07-08 19:14 UTC2026-07-09 12:01 UTC[SSL: CERTIFICATE_VERIFY_FAILED] certificate verify failed (_ssl.c:897)
rsync://mirror.easyname.at/cygwin/!100:39:392026-07-08 15:01 UTC2026-07-15 04:12 UTC2026-10-15 00:01 UTCchange_dir "/src/release/cygport" (in cygwin) failed: No such file or directory (2) rsync error: some files/attrs were not transferred (see previous errors) (code 23) at main.c(1766) [Receiver=3.1.3] [src/release/cygport/sha512.sum]
ftp://ftp.ntua.gr/pub/pc/cygwin/!150:39:382026-06-13 06:01 UTC2026-10-23 14:21 UTC2026-10-23 15:01 UTC550 Failed to open file. [src/release/cygport/sha512.sum]
http://ftp.ntua.gr/pub/pc/cygwin/!60:39:402026-06-13 06:01 UTC2026-10-23 14:21 UTC2026-10-23 15:01 UTC404 Not Found [src/release/cygport/sha512.sum]
http://cygwin.mirror.gtcomm.net/!0Unknown2026-04-02 12:01 UTC2026-04-01 18:14 UTC2026-04-02 00:01 UTCName or service not known
https://cygwin.mirror.gtcomm.net/!0Unknown2026-04-02 12:01 UTC2026-04-01 18:14 UTC2026-04-02 00:01 UTCName or service not known
http://mirror.koddos.net/cygwin/!61Unknown2026-03-25 12:01 UTC2026-08-24 18:14 UTC2026-08-28 00:01 UTC404 Not Found [x86_64/sha512.sum]
https://mirror.koddos.net/cygwin/!63Unknown2026-03-25 12:01 UTC2026-08-24 18:14 UTC2026-08-28 00:01 UTC404 Not Found [x86_64/sha512.sum]
rsync://mirror.koddos.net/cygwin/!15Unknown2026-03-25 12:01 UTC2026-08-24 18:14 UTC2026-08-28 00:01 UTC@ERROR: chroot failed rsync error: error starting client-server protocol (code 5) at main.c(1764) [Receiver=3.1.3]
ftp://mirror.internode.on.net/pub/cygwin/!10Unknown2026-02-21 03:01 UTC2026-02-18 19:44 UTC2026-02-18 21:01 UTC550 /pub/cygwin/x86_64/sha512.sum: No such file or directory
http://mirror.internode.on.net/pub/cygwin/!2Unknown2026-02-21 03:01 UTC2026-02-18 19:44 UTC2026-02-18 21:01 UTC404 Not Found [x86_64/sha512.sum]
http://mirrors.neusoft.edu.cn/cygwin/!91:17:042026-01-15 06:01 UTC2026-01-14 19:14 UTC2026-01-14 21:01 UTC404 Not Found [src/release/cygport/sha512.sum]
https://mirrors.neusoft.edu.cn/cygwin/!111:17:052026-01-15 06:01 UTC2026-01-14 19:14 UTC2026-01-14 21:01 UTC404 Not Found [src/release/cygport/sha512.sum]
http://cygwin.mirrors.hoobly.com/!0420 days, 19:30:032025-08-30 03:01 UTC2025-08-28 19:14 UTC2025-08-29 09:01 UTC404 Not Found [src/release/cygport/sha512.sum]
http://mirror.steadfast.net/cygwin/!61Unknown2025-08-30 03:01 UTC2025-08-28 19:14 UTC2025-08-29 00:01 UTC404 Not Found [x86_64/sha512.sum]
https://cygwin.mirrors.hoobly.com/!1420 days, 19:30:032025-08-30 03:01 UTC2025-08-28 19:14 UTC2025-08-29 09:01 UTC404 Not Found [src/release/cygport/sha512.sum]
https://mirror.steadfast.net/cygwin/!63Unknown2025-08-30 03:01 UTC2025-08-28 19:14 UTC2025-08-29 00:01 UTC404 Not Found [x86_64/sha512.sum]
rsync://mirror.steadfast.net/cygwin/!19Unknown2025-08-30 03:01 UTC2025-08-28 19:14 UTC2025-08-29 00:01 UTC@ERROR: chroot failed rsync error: error starting client-server protocol (code 5) at main.c(1764) [Receiver=3.1.3]
ftp://ftp.kaist.ac.kr/cygwin/!0Unknown2025-02-23 06:01 UTC2025-02-24 00:14 UTC2025-02-24 03:01 UTC[Errno 111] Connection refused
ftp://mirror.lagoon.nc/cygwin/!2Unknown2024-09-19 18:01 UTC2026-10-21 21:18 UTC2026-10-23 06:01 UTC[Errno 13] Permission denied
rsync://rsync.gtlib.gatech.edu/cygwin/!5Unknown2024-01-07 09:01 UTC2024-05-07 16:14 UTC2024-05-08 09:01 UTC@ERROR: access denied to cygwin from vm01.sourceware.org (38.145.34.32) rsync error: error starting client-server protocol (code 5) at main.c(1764) [Receiver=3.1.3]
ftp://ftp.gtlib.gatech.edu/pub/cygwin/!0Unknown2021-04-13 15:18 UTCNo DataNo Data500 OOPS: tcp_wrappers is set to YES but no tcp wrapper support compiled in
ftp://ftp2.osuosl.org/pub/cygwin/!3UnknownNo Data2026-01-05 19:44 UTCNo Data550 Failed to open file. [x86_64/sha512.sum]

Timings
ActivityTime/s
Selecting reference files0
Total to check all mirrors381
Average to check a mirror14

Last updated: 2026-10-23 15:07 UTC